Target
Monoglyceride lipase
Ligand
BDBM474429
Substrate
Meas. Tech.
MAGL Enzymatic Assay (30 minute)
IC50
0.679±n/a nM
Citation
 Brodney, MAButler, CRMcAllister, LAHelal, CJO''Neil, SVVerhoest, PR Heterocyclic spiro compounds as MAGL inhibitors US Patent  US10858373 Publication Date 12/8/2020 
Target
Name:
Monoglyceride lipase
Synonyms:
HU-K5 Lysophospholipase-like MGL MGLL_HUMAN
Type:
Hydrolase
Mol. Mass.:
33264.56
Organism:
Homo sapiens (Human)
Description:
Human recombinant MGL (Cayman Chemical, cat# 10008354).
Residue:
303
  
Inhibitor
Name:
BDBM474429
Synonyms:
US10858373, Example 27
Type:
Small organic molecule
Emp. Form.:
C17H24F6N2O5S
Mol. Mass.:
482.438
SMILES:
CC[C@H]1C[C@H]1S(=O)(=O)N1CCOC2(CCN(CC2)C(=O)OC(C(F)(F)F)C(F)(F)F)C1
: