Target
Monoglyceride lipase
Ligand
BDBM474432
Substrate
Meas. Tech.
MAGL Enzymatic Assay (30 minute)
IC50
134±n/a nM
Citation
 Brodney, MAButler, CRMcAllister, LAHelal, CJO''Neil, SVVerhoest, PR Heterocyclic spiro compounds as MAGL inhibitors US Patent  US10858373 Publication Date 12/8/2020 
Target
Name:
Monoglyceride lipase
Synonyms:
HU-K5 Lysophospholipase-like MGL MGLL_HUMAN
Type:
Hydrolase
Mol. Mass.:
33264.56
Organism:
Homo sapiens (Human)
Description:
Human recombinant MGL (Cayman Chemical, cat# 10008354).
Residue:
303
  
Inhibitor
Name:
BDBM474432
Synonyms:
US10858373, Example 30
Type:
Small organic molecule
Emp. Form.:
C17H21N5O7S
Mol. Mass.:
439.443
SMILES:
O=C(ON1C(=O)CCC1=O)N1CCC2(CC1)CN(CCO2)S(=O)(=O)c1cnccn1
: