Target
Monoglyceride lipase
Ligand
BDBM474446
Substrate
Meas. Tech.
MAGL Enzymatic Assay (30 minute)
IC50
79.8±n/a nM
Citation
 Brodney, MAButler, CRMcAllister, LAHelal, CJO''Neil, SVVerhoest, PR Heterocyclic spiro compounds as MAGL inhibitors US Patent  US10858373 Publication Date 12/8/2020 
Target
Name:
Monoglyceride lipase
Synonyms:
HU-K5 Lysophospholipase-like MGL MGLL_HUMAN
Type:
Hydrolase
Mol. Mass.:
33264.56
Organism:
Homo sapiens (Human)
Description:
Human recombinant MGL (Cayman Chemical, cat# 10008354).
Residue:
303
  
Inhibitor
Name:
BDBM474446
Synonyms:
US10858373, Example 44
Type:
Small organic molecule
Emp. Form.:
C18H29N3O7S
Mol. Mass.:
431.504
SMILES:
CC(C)CS(=O)(=O)N(C)C1COC2(C1)CCN(CC2)C(=O)ON1C(=O)CCC1=O
: