Target
Ataxin-1
Ligand
BDBM474571
Substrate
Meas. Tech.
Enzyme Inhibition Assay
IC50
8.50±n/a nM
Citation
 Mattei, PHunziker, DDi Giorgio, PHert, JRudolph, MWang, L Octahydro-cyclobuta[1,2-c;3,4-c′]dipyrrol-2-yl US Patent  US10849881 Publication Date 12/1/2020 
Target
Name:
Ataxin-1
Synonyms:
ATX1 ATXN1 | SCA1
Type:
Protein
Mol. Mass.:
86941.25
Organism:
Homo sapiens (Human)
Description:
P54253
Residue:
815
  
Inhibitor
Name:
BDBM474571
Synonyms:
(E)-1-[(3aS,3bR,6aS,6bR)-5-(1H- benzotriazole-5-carbonyl)-octahydro- cyclobuta[1,2-c;3,4-c']dipyrrol-2-yl]-3-(4- trifluoromethoxy-phenyl)-propenone | US10849881, Example 1.003
Type:
Small organic molecule
Emp. Form.:
C25H22F3N5O3
Mol. Mass.:
497.4691
SMILES:
FC(F)(F)Oc1ccc(\C=C\C(=O)N2C[C@H]3[C@@H](C2)[C@@H]2CN(C[C@H]32)C(=O)c2ccc3[nH]nnc3c2)cc1
: