Target
Ataxin-1
Ligand
BDBM475763
Substrate
Meas. Tech.
Enzyme Inhibition Assay
IC50
130±n/a nM
Citation
 Mattei, PHunziker, DDi Giorgio, PHert, JRudolph, MWang, L Octahydro-cyclobuta[1,2-c;3,4-c′]dipyrrol-2-yl US Patent  US10849881 Publication Date 12/1/2020 
Target
Name:
Ataxin-1
Synonyms:
ATX1 ATXN1 | SCA1
Type:
Protein
Mol. Mass.:
86941.25
Organism:
Homo sapiens (Human)
Description:
P54253
Residue:
815
  
Inhibitor
Name:
BDBM475763
Synonyms:
US10849881, Example 1.036 | {2-[(3aR,3bS,6aR,6bS)-5-(1H- benzotriazole-5-carbonyl)-octahydro- cyclobuta[1,2-c;3,4-c']dipyrrole-2- carbonyl]-indol-1-yl}-acetonitrile
Type:
Small organic molecule
Emp. Form.:
C26H23N7O2
Mol. Mass.:
465.5065
SMILES:
O=C(N1C[C@H]2[C@@H](C1)[C@@H]1CN(C[C@H]21)C(=O)c1ccc2[nH]nnc2c1)c1cc2ccccc2n1CC#N
: