Target
Ataxin-1
Ligand
BDBM475764
Substrate
Meas. Tech.
Enzyme Inhibition Assay
IC50
159±n/a nM
Citation
 Mattei, PHunziker, DDi Giorgio, PHert, JRudolph, MWang, L Octahydro-cyclobuta[1,2-c;3,4-c′]dipyrrol-2-yl US Patent  US10849881 Publication Date 12/1/2020 
Target
Name:
Ataxin-1
Synonyms:
ATX1 ATXN1 | SCA1
Type:
Protein
Mol. Mass.:
86941.25
Organism:
Homo sapiens (Human)
Description:
P54253
Residue:
815
  
Inhibitor
Name:
BDBM475764
Synonyms:
US10849881, Example 1.037 | [(3aR,3bS,6aR,6bS)-5-(1H-benzotriazole- 5-carbonyl)-octahydro-cyclobuta[1,2-c;3,4- c']dipyrrol-2-yl]-(1-isobutyl-1H-indol-2- yl)-methanone
Type:
Small organic molecule
Emp. Form.:
C28H30N6O2
Mol. Mass.:
482.5768
SMILES:
CC(C)Cn1c(cc2ccccc12)C(=O)N1C[C@H]2[C@@H](C1)[C@@H]1CN(C[C@H]21)C(=O)c1ccc2[nH]nnc2c1
: