Target
Ataxin-1
Ligand
BDBM475773
Substrate
Meas. Tech.
Enzyme Inhibition Assay
IC50
28.0±n/a nM
Citation
 Mattei, PHunziker, DDi Giorgio, PHert, JRudolph, MWang, L Octahydro-cyclobuta[1,2-c;3,4-c′]dipyrrol-2-yl US Patent  US10849881 Publication Date 12/1/2020 
Target
Name:
Ataxin-1
Synonyms:
ATX1 ATXN1 | SCA1
Type:
Protein
Mol. Mass.:
86941.25
Organism:
Homo sapiens (Human)
Description:
P54253
Residue:
815
  
Inhibitor
Name:
BDBM475773
Synonyms:
US10849881, Example 1.046 | [(3aR,3bS,6aR,6bS)-5-(1H-benzotriazole- 5-carbonyl)-octahydro-cyclobuta[1,2-c;3,4- c']dipyrrol-2-yl]-(1-methoxy-isoquinolin-3- yl)-methanone
Type:
Small organic molecule
Emp. Form.:
C26H24N6O3
Mol. Mass.:
468.5072
SMILES:
COc1nc(cc2ccccc12)C(=O)N1C[C@H]2[C@@H]3CN(C[C@@H]3[C@H]2C1)C(=O)c1ccc2[nH]nnc2c1
: