Target
Ataxin-1
Ligand
BDBM475789
Substrate
Meas. Tech.
Enzyme Inhibition Assay
IC50
9.00±n/a nM
Citation
 Mattei, PHunziker, DDi Giorgio, PHert, JRudolph, MWang, L Octahydro-cyclobuta[1,2-c;3,4-c′]dipyrrol-2-yl US Patent  US10849881 Publication Date 12/1/2020 
Target
Name:
Ataxin-1
Synonyms:
ATX1 ATXN1 | SCA1
Type:
Protein
Mol. Mass.:
86941.25
Organism:
Homo sapiens (Human)
Description:
P54253
Residue:
815
  
Inhibitor
Name:
BDBM475789
Synonyms:
4-[(3aS,3bS,6aR,6bR)-5-(4-isopropoxy- naphthalene-2-carbonyl)-octahydro- cyclobuta[1,2-c;3,4-c']dipyrrole-2- carbonyl]benzenesulfonamide | US10849881, Example 1.062
Type:
Small organic molecule
Emp. Form.:
C29H31N3O5S
Mol. Mass.:
533.639
SMILES:
CC(C)Oc1cc(cc2ccccc12)C(=O)N1C[C@H]2[C@@H]3CN(C[C@@H]3[C@H]2C1)C(=O)c1ccc(cc1)S(N)(=O)=O
: