Target
Ataxin-1
Ligand
BDBM475796
Substrate
Meas. Tech.
Enzyme Inhibition Assay
IC50
8.00±n/a nM
Citation
 Mattei, PHunziker, DDi Giorgio, PHert, JRudolph, MWang, L Octahydro-cyclobuta[1,2-c;3,4-c′]dipyrrol-2-yl US Patent  US10849881 Publication Date 12/1/2020 
Target
Name:
Ataxin-1
Synonyms:
ATX1 ATXN1 | SCA1
Type:
Protein
Mol. Mass.:
86941.25
Organism:
Homo sapiens (Human)
Description:
P54253
Residue:
815
  
Inhibitor
Name:
BDBM475796
Synonyms:
US10849881, Example 1.069 | [(3aR,3bS,6aR,6bS)-5-(1H-benzotriazole- 5-carbonyl)-octahydro-cyclobuta[1,2-c;3,4- c']dipyrrol-2-yl]-[4-(2-methoxy-ethoxy)- quinolin-2-yl]-methanone
Type:
Small organic molecule
Emp. Form.:
C28H28N6O4
Mol. Mass.:
512.5597
SMILES:
COCCOc1cc(nc2ccccc12)C(=O)N1C[C@H]2[C@@H]3CN(C[C@@H]3[C@H]2C1)C(=O)c1ccc2[nH]nnc2c1
: