Target
Ataxin-1
Ligand
BDBM475828
Substrate
Meas. Tech.
Enzyme Inhibition Assay
IC50
4433±n/a nM
Citation
 Mattei, PHunziker, DDi Giorgio, PHert, JRudolph, MWang, L Octahydro-cyclobuta[1,2-c;3,4-c′]dipyrrol-2-yl US Patent  US10849881 Publication Date 12/1/2020 
Target
Name:
Ataxin-1
Synonyms:
ATX1 ATXN1 | SCA1
Type:
Protein
Mol. Mass.:
86941.25
Organism:
Homo sapiens (Human)
Description:
P54253
Residue:
815
  
Inhibitor
Name:
BDBM475828
Synonyms:
(1H-benzotriazol-5-yl)- {(3aS,3bR,6aS,6bR)-5-[5-(2,2,2-trifluoro- ethoxy)-pyridine-2-carbonyl]-octahydro- cyclobuta[1,2-c;3,4-c']dipyrrol-2-yl}- methanone | US10849881, Example 1.101
Type:
Small organic molecule
Emp. Form.:
C23H23F3N6O3
Mol. Mass.:
488.4623
SMILES:
FC(F)(F)COc1ccc(nc1)C(=O)N1C[C@H]2[C@@H]3CN(C[C@@H]3[C@H]2C1)C(=O)c1ccc2NNNc2c1
: