Target
Ataxin-1
Ligand
BDBM475840
Substrate
Meas. Tech.
Enzyme Inhibition Assay
IC50
4.50±n/a nM
Citation
 Mattei, PHunziker, DDi Giorgio, PHert, JRudolph, MWang, L Octahydro-cyclobuta[1,2-c;3,4-c′]dipyrrol-2-yl US Patent  US10849881 Publication Date 12/1/2020 
Target
Name:
Ataxin-1
Synonyms:
ATX1 ATXN1 | SCA1
Type:
Protein
Mol. Mass.:
86941.25
Organism:
Homo sapiens (Human)
Description:
P54253
Residue:
815
  
Inhibitor
Name:
BDBM475840
Synonyms:
(3aR,3bS,6aR,6bS)-5-(1H-Benzotriazole-5-carbonyl)-octahydro-cyclobuta[1,2-c;3,4-c′]dipyrrole-2-carboxylic Acid 3,5-dichloro-benzyl Ester | US10849881, Example 2.001
Type:
Small organic molecule
Emp. Form.:
C23H21Cl2N5O3
Mol. Mass.:
486.351
SMILES:
Clc1cc(Cl)cc(COC(=O)N2C[C@H]3[C@@H](C2)[C@@H]2CN(C[C@H]32)C(=O)c2ccc3[nH]nnc3c2)c1
: