Target
Complement factor D
Ligand
BDBM474772
Substrate
Meas. Tech.
Inhibition Assay
IC50
<1000±n/a nM
Citation
 Kotian, PLBabu, YSZhang, WVogeti, LWu, MChintareddy, VRRaman, K Benzopyrazole compounds and analogues thereof US Patent  US10849883 Publication Date 12/1/2020 
Target
Name:
Complement factor D
Synonyms:
Adipsin CFAD_HUMAN DF Properdin factor D
Type:
Protein
Mol. Mass.:
27039.19
Organism:
Homo sapiens (Human)
Description:
P00746
Residue:
253
  
Inhibitor
Name:
BDBM474772
Synonyms:
US10849883, Compound 202e | US11559515, Compound 202e
Type:
Small organic molecule
Emp. Form.:
C24H22BrClFN3O3
Mol. Mass.:
534.805
SMILES:
CC(=O)c1cn(CC(=O)N(CC(=O)NCc2cccc(Cl)c2F)C2CC2)c2cc(Br)ccc12
: