Target
Complement factor D
Ligand
BDBM474829
Substrate
Meas. Tech.
Inhibition Assay
IC50
<1000±n/a nM
Citation
 Kotian, PLBabu, YSZhang, WVogeti, LWu, MChintareddy, VRRaman, K Benzopyrazole compounds and analogues thereof US Patent  US10849883 Publication Date 12/1/2020 
Target
Name:
Complement factor D
Synonyms:
Adipsin CFAD_HUMAN DF Properdin factor D
Type:
Protein
Mol. Mass.:
27039.19
Organism:
Homo sapiens (Human)
Description:
P00746
Residue:
253
  
Inhibitor
Name:
BDBM474829
Synonyms:
US10849883, Compound 256a | US11559515, Compound 256a
Type:
Small organic molecule
Emp. Form.:
C32H29ClFN9O4
Mol. Mass.:
658.082
SMILES:
CC(C)N(CC(=O)Nc1cccc(c1F)-c1ccccc1Cl)C(=O)Cn1nc(C(N)=O)c2cc(NC(=O)Nc3cncnc3)ccc12
: