Target
ADP-ribosylation factor 6
Ligand
BDBM474962
Substrate
Meas. Tech.
Biochemical Assay
IC50
0.960±n/a nM
Citation
 Ostanin, KShenderovich, MBajji, ACioffi, CLMoss, NVankayalapati, HLi, D Arf6 inhibitors and methods of synthesis and use thereof US Patent  US10849901 Publication Date 12/1/2020 
Target
Name:
ADP-ribosylation factor 6
Synonyms:
ARF6 | ARF6_HUMAN
Type:
Protein
Mol. Mass.:
20087.47
Organism:
Human
Description:
P62330
Residue:
175
  
Inhibitor
Name:
BDBM474962
Synonyms:
US10849901, Compound 12
Type:
Small organic molecule
Emp. Form.:
C25H16ClF3N4O
Mol. Mass.:
480.869
SMILES:
Cc1ccc(cn1)-c1cccc(c1)-c1cc(=O)n2nc(c(-c3ccc(Cl)cc3)c2[nH]1)C(F)(F)F
: