Target
ADP-ribosylation factor 6
Ligand
BDBM474964
Substrate
Meas. Tech.
Biochemical Assay
IC50
1.000±n/a nM
Citation
 Ostanin, KShenderovich, MBajji, ACioffi, CLMoss, NVankayalapati, HLi, D Arf6 inhibitors and methods of synthesis and use thereof US Patent  US10849901 Publication Date 12/1/2020 
Target
Name:
ADP-ribosylation factor 6
Synonyms:
ARF6 | ARF6_HUMAN
Type:
Protein
Mol. Mass.:
20087.47
Organism:
Human
Description:
P62330
Residue:
175
  
Inhibitor
Name:
BDBM474964
Synonyms:
US10849901, Compound 14
Type:
Small organic molecule
Emp. Form.:
C27H19Cl2N3O2
Mol. Mass.:
488.365
SMILES:
Clc1ccc(cc1Cl)-c1c(nn2c1[nH]c(cc2=O)-c1cccc(Oc2ccccc2)c1)C1CC1
: