Target
ADP-ribosylation factor 6
Ligand
BDBM474965
Substrate
Meas. Tech.
Biochemical Assay
IC50
1.10±n/a nM
Citation
 Ostanin, KShenderovich, MBajji, ACioffi, CLMoss, NVankayalapati, HLi, D Arf6 inhibitors and methods of synthesis and use thereof US Patent  US10849901 Publication Date 12/1/2020 
Target
Name:
ADP-ribosylation factor 6
Synonyms:
ARF6 | ARF6_HUMAN
Type:
Protein
Mol. Mass.:
20087.47
Organism:
Human
Description:
P62330
Residue:
175
  
Inhibitor
Name:
BDBM474965
Synonyms:
US10849901, Compound 15
Type:
Small organic molecule
Emp. Form.:
C19H10BrClF3N3O
Mol. Mass.:
468.654
SMILES:
FC(F)(F)c1nn2c([nH]c(cc2=O)-c2ccc(Br)cc2)c1-c1ccc(Cl)cc1
: