Target
ADP-ribosylation factor 6
Ligand
BDBM474972
Substrate
Meas. Tech.
Biochemical Assay
IC50
1.40±n/a nM
Citation
 Ostanin, KShenderovich, MBajji, ACioffi, CLMoss, NVankayalapati, HLi, D Arf6 inhibitors and methods of synthesis and use thereof US Patent  US10849901 Publication Date 12/1/2020 
Target
Name:
ADP-ribosylation factor 6
Synonyms:
ARF6 | ARF6_HUMAN
Type:
Protein
Mol. Mass.:
20087.47
Organism:
Human
Description:
P62330
Residue:
175
  
Inhibitor
Name:
BDBM474972
Synonyms:
US10849901, Compound 22 | US10849901, Compound 27
Type:
Small organic molecule
Emp. Form.:
C21H14Cl2N4O3
Mol. Mass.:
441.267
SMILES:
[O-][N+](=O)c1ccc(cc1)-c1cc(=O)n2nc(C3CC3)c(-c3ccc(Cl)c(Cl)c3)c2[nH]1
: