Target
ADP-ribosylation factor 6
Ligand
BDBM475006
Substrate
Meas. Tech.
Biochemical Assay
IC50
3.20±n/a nM
Citation
 Ostanin, KShenderovich, MBajji, ACioffi, CLMoss, NVankayalapati, HLi, D Arf6 inhibitors and methods of synthesis and use thereof US Patent  US10849901 Publication Date 12/1/2020 
Target
Name:
ADP-ribosylation factor 6
Synonyms:
ARF6 | ARF6_HUMAN
Type:
Protein
Mol. Mass.:
20087.47
Organism:
Human
Description:
P62330
Residue:
175
  
Inhibitor
Name:
BDBM475006
Synonyms:
US10849901, Compound 56
Type:
Small organic molecule
Emp. Form.:
C28H23ClN4O2
Mol. Mass.:
482.961
SMILES:
CN(C)C(=O)c1ccc(cc1)-c1cc(=O)n2nc(Cc3ccccc3)c(-c3ccc(Cl)cc3)c2[nH]1
: