Target
ADP-ribosylation factor 6
Ligand
BDBM475027
Substrate
Meas. Tech.
Biochemical Assay
IC50
5.10±n/a nM
Citation
 Ostanin, KShenderovich, MBajji, ACioffi, CLMoss, NVankayalapati, HLi, D Arf6 inhibitors and methods of synthesis and use thereof US Patent  US10849901 Publication Date 12/1/2020 
Target
Name:
ADP-ribosylation factor 6
Synonyms:
ARF6 | ARF6_HUMAN
Type:
Protein
Mol. Mass.:
20087.47
Organism:
Human
Description:
P62330
Residue:
175
  
Inhibitor
Name:
BDBM475027
Synonyms:
US10849901, Compound 77
Type:
Small organic molecule
Emp. Form.:
C23H19ClN4O4
Mol. Mass.:
450.874
SMILES:
[O-][N+](=O)c1ccc(cc1)-c1cc(=O)n2nc(C3CCOCC3)c(-c3ccc(Cl)cc3)c2[nH]1
: