Target
ADP-ribosylation factor 6
Ligand
BDBM475058
Substrate
Meas. Tech.
Biochemical Assay
IC50
16.0±n/a nM
Citation
 Ostanin, KShenderovich, MBajji, ACioffi, CLMoss, NVankayalapati, HLi, D Arf6 inhibitors and methods of synthesis and use thereof US Patent  US10849901 Publication Date 12/1/2020 
Target
Name:
ADP-ribosylation factor 6
Synonyms:
ARF6 | ARF6_HUMAN
Type:
Protein
Mol. Mass.:
20087.47
Organism:
Human
Description:
P62330
Residue:
175
  
Inhibitor
Name:
BDBM475058
Synonyms:
US10849901, Compound 108
Type:
Small organic molecule
Emp. Form.:
C22H15ClN4O
Mol. Mass.:
386.834
SMILES:
Clc1ccc(cc1)-c1c(nc2n1[nH]c(cc2=O)-c1ccc(cc1)C#N)C1CC1
: