Target
ADP-ribosylation factor 6
Ligand
BDBM475060
Substrate
Meas. Tech.
Biochemical Assay
IC50
19.0±n/a nM
Citation
 Ostanin, KShenderovich, MBajji, ACioffi, CLMoss, NVankayalapati, HLi, D Arf6 inhibitors and methods of synthesis and use thereof US Patent  US10849901 Publication Date 12/1/2020 
Target
Name:
ADP-ribosylation factor 6
Synonyms:
ARF6 | ARF6_HUMAN
Type:
Protein
Mol. Mass.:
20087.47
Organism:
Human
Description:
P62330
Residue:
175
  
Inhibitor
Name:
BDBM475060
Synonyms:
US10849901, Compound 110
Type:
Small organic molecule
Emp. Form.:
C18H18N4O3
Mol. Mass.:
338.3605
SMILES:
Cc1nn2c([nH]c(cc2=O)-c2ccc(cc2)[N+]([O-])=O)c1C1CCCC1
: