Target
ADP-ribosylation factor 6
Ligand
BDBM475071
Substrate
Meas. Tech.
Biochemical Assay
IC50
3.70±n/a nM
Citation
 Ostanin, KShenderovich, MBajji, ACioffi, CLMoss, NVankayalapati, HLi, D Arf6 inhibitors and methods of synthesis and use thereof US Patent  US10849901 Publication Date 12/1/2020 
Target
Name:
ADP-ribosylation factor 6
Synonyms:
ARF6 | ARF6_HUMAN
Type:
Protein
Mol. Mass.:
20087.47
Organism:
Human
Description:
P62330
Residue:
175
  
Inhibitor
Name:
BDBM475071
Synonyms:
US10849901, Compound 121
Type:
Small organic molecule
Emp. Form.:
C25H19N3OS2
Mol. Mass.:
441.568
SMILES:
O=C1NC(=S)S\C1=C\c1ccc(cc1)N1N=C(CC1c1ccccc1)c1ccccc1
: