Target
ADP-ribosylation factor 6
Ligand
BDBM475080
Substrate
Meas. Tech.
Biochemical Assay
IC50
9.90±n/a nM
Citation
 Ostanin, KShenderovich, MBajji, ACioffi, CLMoss, NVankayalapati, HLi, D Arf6 inhibitors and methods of synthesis and use thereof US Patent  US10849901 Publication Date 12/1/2020 
Target
Name:
ADP-ribosylation factor 6
Synonyms:
ARF6 | ARF6_HUMAN
Type:
Protein
Mol. Mass.:
20087.47
Organism:
Human
Description:
P62330
Residue:
175
  
Inhibitor
Name:
BDBM475080
Synonyms:
US10849901, Compound 130
Type:
Small organic molecule
Emp. Form.:
C16H12BrN3O3
Mol. Mass.:
374.189
SMILES:
Cc1ccc(cn1)C(=O)OCc1cc(=O)n2cc(Br)ccc2n1
: