Target
ADP-ribosylation factor 6
Ligand
BDBM475088
Substrate
Meas. Tech.
Biochemical Assay
IC50
17.0±n/a nM
Citation
 Ostanin, KShenderovich, MBajji, ACioffi, CLMoss, NVankayalapati, HLi, D Arf6 inhibitors and methods of synthesis and use thereof US Patent  US10849901 Publication Date 12/1/2020 
Target
Name:
ADP-ribosylation factor 6
Synonyms:
ARF6 | ARF6_HUMAN
Type:
Protein
Mol. Mass.:
20087.47
Organism:
Human
Description:
P62330
Residue:
175
  
Inhibitor
Name:
BDBM475088
Synonyms:
US10849901, Compound 138
Type:
Small organic molecule
Emp. Form.:
C13H8N4OS3
Mol. Mass.:
332.424
SMILES:
O=c1[nH]c(CSc2ncnc3sccc23)nc2ccsc12
: