Target
Nuclear receptor ROR-gamma
Ligand
BDBM441836
Substrate
Meas. Tech.
Fluorescence Resonance Energy Transfer (FRET) Assay
IC50
2750±n/a nM
Citation
 Wang, YHuang, YYu, FTang, T Biaryl urea derivative or salt thereof and preparation process and use for the same US Patent  US10851050 Publication Date 12/1/2020 
Target
Name:
Nuclear receptor ROR-gamma
Synonyms:
NR1F3 Nuclear receptor ROR-gamma (RORC) RAR-related orphan receptor C (RORc) RORG RZRG Retinoid-related orphan receptor-gamma (RORc)
Type:
Enzyme Catalytic Domain
Mol. Mass.:
58218.40
Organism:
Homo sapiens (Human)
Description:
P51449
Residue:
518
  
Inhibitor
Name:
BDBM441836
Synonyms:
US10647665, Example 1-22b | US10851050, Example I-22b
Type:
Small organic molecule
Emp. Form.:
C27H23F3N4O4
Mol. Mass.:
524.4911
SMILES:
Cn1cc(cn1)-c1cccc(OC(F)(F)F)c1-c1ccc(NC(=O)NCc2ccc(CC(O)=O)cc2)cc1
: