Target
Egl nine homolog 1 [181-417]
Ligand
BDBM475489
Substrate
Meas. Tech.
Enzyme Activity Assay
IC50
50.1±n/a nM
Citation
 Hocutt, FMLeonard, Jr., BEPeltier, HMPhuong, VKRabinowitz, MHRosen, MDTarantino, KTVenkatesan, HZhao, LX Benzoimidazoles as prolyl hydroxylase inhibitors US Patent  US10851083 Publication Date 12/1/2020 
Target
Name:
Egl nine homolog 1 [181-417]
Synonyms:
C1orf12 EGLN1_HUMAN | Egl nine homolog 1 (aa 181-417)
Type:
Enzyme
Mol. Mass.:
26555.51
Organism:
Homo sapiens (Human)
Description:
aa 181-417
Residue:
237
  
Inhibitor
Name:
BDBM475489
Synonyms:
1-[5-Chloro-6-(propane-2-sulfonyl)-1H-benzoimidazol-2- US11618744, Example 101
Type:
Small organic molecule
Emp. Form.:
C14H13ClN4O4S
Mol. Mass.:
368.795
SMILES:
CC(C)S(=O)(=O)c1cc2[nH]c(nc2cc1Cl)-n1cc(cn1)C(O)=O
: