Target
Egl nine homolog 1 [181-417]
Ligand
BDBM475503
Substrate
Meas. Tech.
Enzyme Activity Assay
IC50
794±n/a nM
Citation
 Hocutt, FMLeonard, Jr., BEPeltier, HMPhuong, VKRabinowitz, MHRosen, MDTarantino, KTVenkatesan, HZhao, LX Benzoimidazoles as prolyl hydroxylase inhibitors US Patent  US10851083 Publication Date 12/1/2020 
Target
Name:
Egl nine homolog 1 [181-417]
Synonyms:
C1orf12 EGLN1_HUMAN | Egl nine homolog 1 (aa 181-417)
Type:
Enzyme
Mol. Mass.:
26555.51
Organism:
Homo sapiens (Human)
Description:
aa 181-417
Residue:
237
  
Inhibitor
Name:
BDBM475503
Synonyms:
1-(3H-Naphtho[1,2-d]imidazol-2-yl)-1H-pyrazole-4- US11618744, Example 115
Type:
Small organic molecule
Emp. Form.:
C15H10N4O2
Mol. Mass.:
278.2655
SMILES:
OC(=O)c1cnn(c1)-c1nc2c(ccc3ccccc23)[nH]1
: