Target
Egl nine homolog 1 [181-417]
Ligand
BDBM475529
Substrate
Meas. Tech.
Enzyme Activity Assay
IC50
251±n/a nM
Citation
 Hocutt, FMLeonard, Jr., BEPeltier, HMPhuong, VKRabinowitz, MHRosen, MDTarantino, KTVenkatesan, HZhao, LX Benzoimidazoles as prolyl hydroxylase inhibitors US Patent  US10851083 Publication Date 12/1/2020 
Target
Name:
Egl nine homolog 1 [181-417]
Synonyms:
C1orf12 EGLN1_HUMAN | Egl nine homolog 1 (aa 181-417)
Type:
Enzyme
Mol. Mass.:
26555.51
Organism:
Homo sapiens (Human)
Description:
aa 181-417
Residue:
237
  
Inhibitor
Name:
BDBM475529
Synonyms:
1-(5-Benzoylamino-6-chloro-1H-benzoimidazol-2-yl)-1H- US11618744, Example 141
Type:
Small organic molecule
Emp. Form.:
C18H12ClN5O3
Mol. Mass.:
381.773
SMILES:
OC(=O)c1cnn(c1)-c1nc2cc(NC(=O)c3ccccc3)c(Cl)cc2[nH]1
: