Target
Egl nine homolog 1 [181-417]
Ligand
BDBM475545
Substrate
Meas. Tech.
Enzyme Activity Assay
IC50
39.8±n/a nM
Citation
 Hocutt, FMLeonard, Jr., BEPeltier, HMPhuong, VKRabinowitz, MHRosen, MDTarantino, KTVenkatesan, HZhao, LX Benzoimidazoles as prolyl hydroxylase inhibitors US Patent  US10851083 Publication Date 12/1/2020 
Target
Name:
Egl nine homolog 1 [181-417]
Synonyms:
C1orf12 EGLN1_HUMAN | Egl nine homolog 1 (aa 181-417)
Type:
Enzyme
Mol. Mass.:
26555.51
Organism:
Homo sapiens (Human)
Description:
aa 181-417
Residue:
237
  
Inhibitor
Name:
BDBM475545
Synonyms:
1-(6-Fluoro-5-propylsulfonyl-1H-benzoimidazol-2-yl)-1H- US11618744, Example 157
Type:
Small organic molecule
Emp. Form.:
C14H13FN4O4S
Mol. Mass.:
352.341
SMILES:
CCCS(=O)(=O)c1cc2nc([nH]c2cc1F)-n1cc(cn1)C(O)=O
: