Target
Fibroblast growth factor receptor 2
Ligand
BDBM475660
Substrate
Meas. Tech.
Enzymatic Assay
IC50
115±n/a nM
Citation
 Wu, LLu, LQian, DShen, BYao, W Bicyclic heterocycles as FGFR4 inhibitors US Patent  US10851105 Publication Date 12/1/2020 
Target
Name:
Fibroblast growth factor receptor 2
Synonyms:
BEK FGFR-2 FGFR2 Fibroblast growth factor receptor 2 (FGFR2) KGFR Keratinocyte growth factor receptor VEGF-receptor 2 and Fibroblast growth factor receptor 2
Type:
Enzyme
Mol. Mass.:
92015.45
Organism:
Homo sapiens (Human)
Description:
P21802
Residue:
821
  
Inhibitor
Name:
BDBM475660
Synonyms:
N-(2-(2′-(2,6-difluoro-3,5-dimethoxyphenyl)-3′-oxo-2′,3′-dihydro-1H-spiro[cyclopropane-1,4′-[2,7]naphthyridine]-6′-ylamino)phenyl)acrylamide | US10851105, Example 1
Type:
Small organic molecule
Emp. Form.:
C27H24F2N4O4
Mol. Mass.:
506.5007
SMILES:
COc1cc(OC)c(F)c(N2Cc3cnc(Nc4ccccc4NC(=O)C=C)cc3C3(CC3)C2=O)c1F
: