Target
Fibroblast growth factor receptor 2
Ligand
BDBM475665
Substrate
Meas. Tech.
Enzymatic Assay
IC50
>200±n/a nM
Citation
 Wu, LLu, LQian, DShen, BYao, W Bicyclic heterocycles as FGFR4 inhibitors US Patent  US10851105 Publication Date 12/1/2020 
Target
Name:
Fibroblast growth factor receptor 2
Synonyms:
BEK FGFR-2 FGFR2 Fibroblast growth factor receptor 2 (FGFR2) KGFR Keratinocyte growth factor receptor VEGF-receptor 2 and Fibroblast growth factor receptor 2
Type:
Enzyme
Mol. Mass.:
92015.45
Organism:
Homo sapiens (Human)
Description:
P21802
Residue:
821
  
Inhibitor
Name:
BDBM475665
Synonyms:
N-(2-(7-(2,6-difluoro-3,5-dimethoxyphenyl)-5,5-dimethyl-6-oxo-5,6,7,8-tetrahydro-2,7-naphthyridin-3-ylamino)phenyl)acrylamide | US10851105, Example 6
Type:
Small organic molecule
Emp. Form.:
C27H26F2N4O4
Mol. Mass.:
508.5165
SMILES:
COc1cc(OC)c(F)c(N2Cc3cnc(Nc4ccccc4NC(=O)C=C)cc3C(C)(C)C2=O)c1F
: