Target
Fibroblast growth factor receptor 3
Ligand
BDBM475666
Substrate
Meas. Tech.
Enzymatic Assay
IC50
>200±n/a nM
Citation
 Wu, LLu, LQian, DShen, BYao, W Bicyclic heterocycles as FGFR4 inhibitors US Patent  US10851105 Publication Date 12/1/2020 
Target
Name:
Fibroblast growth factor receptor 3
Synonyms:
CD_antigen: CD333 FGFR3 Fibroblast growth factor receptor JTK4
Type:
Protein
Mol. Mass.:
87699.57
Organism:
Homo sapiens (Human)
Description:
P22607
Residue:
806
  
Inhibitor
Name:
BDBM475666
Synonyms:
N-(2-(2′-(2,6-difluoro-3,5-dimethoxyphenyl)-3′-oxo-2′,3′-dihydro-1′H-spiro [cyclopentane-1,4′-[2,7]naphthyridine]-6′-ylamino)phenyl)acrylamide | US10851105, Example 7
Type:
Small organic molecule
Emp. Form.:
C29H28F2N4O4
Mol. Mass.:
534.5538
SMILES:
COc1cc(OC)c(F)c(N2Cc3cnc(Nc4ccccc4NC(=O)C=C)cc3C3(CCCC3)C2=O)c1F
: