Target
Fibroblast growth factor receptor 2
Ligand
BDBM475670
Substrate
Meas. Tech.
Enzymatic Assay
IC50
>200±n/a nM
Citation
 Wu, LLu, LQian, DShen, BYao, W Bicyclic heterocycles as FGFR4 inhibitors US Patent  US10851105 Publication Date 12/1/2020 
Target
Name:
Fibroblast growth factor receptor 2
Synonyms:
BEK FGFR-2 FGFR2 Fibroblast growth factor receptor 2 (FGFR2) KGFR Keratinocyte growth factor receptor VEGF-receptor 2 and Fibroblast growth factor receptor 2
Type:
Enzyme
Mol. Mass.:
92015.45
Organism:
Homo sapiens (Human)
Description:
P21802
Residue:
821
  
Inhibitor
Name:
BDBM475670
Synonyms:
N-(2-(2′-(2,6-difluoro-3,5-dimethoxyphenyl)-3′-oxo-2′,3′-dihydro-1′H-spiro [cyclopropane-1,4′-[2,7]naphthyridine]-6′-ylamino)-4-(4-methylpiperazin-1-yl)phenyl)acrylamide | US10851105, Example 11
Type:
Small organic molecule
Emp. Form.:
C32H34F2N6O4
Mol. Mass.:
604.647
SMILES:
COc1cc(OC)c(F)c(N2Cc3cnc(Nc4cc(ccc4NC(=O)C=C)N4CCN(C)CC4)cc3C3(CC3)C2=O)c1F
: