Target
ATP-sensitive inward rectifier potassium channel 1
Ligand
BDBM475676
Substrate
Meas. Tech.
Electrophysiology Assay
IC50
12.0±n/a nM
Citation
 Gunaga, PRichter, JYadav, NDPanda, MGodesi, S Substituted bicyclic heterocyclic compounds US Patent  US10851108 Publication Date 12/1/2020 
Target
Name:
ATP-sensitive inward rectifier potassium channel 1
Synonyms:
ATP-regulated potassium channel ROM-K ATP-sensitive inward rectifier potassium channel 1 KCNJ1 Potassium channel (ATP modulatory) ROMK1 The Renal Outer Medullary Potassium (ROMK)
Type:
Enzyme Catalytic Domain
Mol. Mass.:
44809.08
Organism:
Homo sapiens (Human)
Description:
gi_223460826
Residue:
391
  
Inhibitor
Name:
BDBM475676
Synonyms:
1-(6-(2-hydroxy-2-(4-methyl-1-oxo- 1,3-dihydroisobenzofuran-5-yl)ethyl)- 5,6,7,8-tetrahydropyrido[4,3-d]pyrimidin- 2-yl)-1H-pyrazole-4-carbonitrile (Enantiomer-I) | US10851108, Example 56-I
Type:
Small organic molecule
Emp. Form.:
C22H20N6O3
Mol. Mass.:
416.4326
SMILES:
Cc1c2COC(=O)c2ccc1C(O)CN1CCc2nc(ncc2C1)-n1cc(cn1)C#N
: