Target
Tyrosine-protein phosphatase non-receptor type 11 [E76K]
Ligand
BDBM384119
Substrate
Meas. Tech.
Enzymatic Assay
IC50
1072±n/a nM
Citation
 Jones, PCzako, BCross, JLeonard, PMseeh, FParker, CA Heterocyclic inhibitors of PTPN11 US Patent  US10851110 Publication Date 12/1/2020 
Target
Name:
Tyrosine-protein phosphatase non-receptor type 11 [E76K]
Synonyms:
PTN11_HUMAN PTPN11 SHPTP2 Tyrosine-protein phosphatase non-receptor type 11 (PTPN11)(E76K)
Type:
Enzyme Catalytic Domain
Mol. Mass.:
68019.14
Organism:
Homo sapiens (Human)
Description:
Q06124[E76K]
Residue:
593
  
Inhibitor
Name:
BDBM384119
Synonyms:
(1R,5S,6S)-3-(3-(2,3- dichlorophenyl)-1H- pyrazolo[3,4-b]- pyrazin-6-yl)-3-aza- bicyclo[3.1.0]hexan- 6-amine US10851110, Example 3 | US11466017, Example 3
Type:
Small organic molecule
Emp. Form.:
C16H14Cl2N6
Mol. Mass.:
361.229
SMILES:
N[C@H]1[C@@H]2CN(C[C@H]12)c1cnc2c(n[nH]c2n1)-c1cccc(Cl)c1Cl
: