Target
Tyrosine-protein phosphatase non-receptor type 11 [E76K]
Ligand
BDBM384165
Substrate
Meas. Tech.
Enzymatic Assay
IC50
313±n/a nM
Citation
 Jones, PCzako, BCross, JLeonard, PMseeh, FParker, CA Heterocyclic inhibitors of PTPN11 US Patent  US10851110 Publication Date 12/1/2020 
Target
Name:
Tyrosine-protein phosphatase non-receptor type 11 [E76K]
Synonyms:
PTN11_HUMAN PTPN11 SHPTP2 Tyrosine-protein phosphatase non-receptor type 11 (PTPN11)(E76K)
Type:
Enzyme Catalytic Domain
Mol. Mass.:
68019.14
Organism:
Homo sapiens (Human)
Description:
Q06124[E76K]
Residue:
593
  
Inhibitor
Name:
BDBM384165
Synonyms:
(R)-8-(3-(3-chloro-5- methoxyphenyl)-1H- pyrazolo[3,4- b]pyrazin-6-yl)-8- azaspiro[4.5]decan- 1-amine US10851110, Example 52 | US11466017, Example 52
Type:
Small organic molecule
Emp. Form.:
C21H25ClN6O
Mol. Mass.:
412.916
SMILES:
COc1cc(Cl)cc(c1)-c1n[nH]c2nc(cnc12)N1CCC2(CCC[C@H]2N)CC1
: