Target
Tyrosine-protein phosphatase non-receptor type 11 [E76K]
Ligand
BDBM384166
Substrate
Meas. Tech.
Enzymatic Assay
IC50
641±n/a nM
Citation
 Jones, PCzako, BCross, JLeonard, PMseeh, FParker, CA Heterocyclic inhibitors of PTPN11 US Patent  US10851110 Publication Date 12/1/2020 
Target
Name:
Tyrosine-protein phosphatase non-receptor type 11 [E76K]
Synonyms:
PTN11_HUMAN PTPN11 SHPTP2 Tyrosine-protein phosphatase non-receptor type 11 (PTPN11)(E76K)
Type:
Enzyme Catalytic Domain
Mol. Mass.:
68019.14
Organism:
Homo sapiens (Human)
Description:
Q06124[E76K]
Residue:
593
  
Inhibitor
Name:
BDBM384166
Synonyms:
(R)-8-(3-(2-chloro- pyridin-3-yl)-1H- pyrazolo[3,4-b]- pyrazin-6-yl)-8- aza- spiro[4.5]decan-1- amine US10851110, Example 56 | US11466017, Example 53
Type:
Small organic molecule
Emp. Form.:
C19H22ClN7
Mol. Mass.:
383.878
SMILES:
N[C@@H]1CCCC11CCN(CC1)c1cnc2c(n[nH]c2n1)-c1cccnc1Cl
: