Target
Tyrosine-protein phosphatase non-receptor type 11 [E76K]
Ligand
BDBM384184
Substrate
Meas. Tech.
Enzymatic Assay
IC50
99.0±n/a nM
Citation
 Jones, PCzako, BCross, JLeonard, PMseeh, FParker, CA Heterocyclic inhibitors of PTPN11 US Patent  US10851110 Publication Date 12/1/2020 
Target
Name:
Tyrosine-protein phosphatase non-receptor type 11 [E76K]
Synonyms:
PTN11_HUMAN PTPN11 SHPTP2 Tyrosine-protein phosphatase non-receptor type 11 (PTPN11)(E76K)
Type:
Enzyme Catalytic Domain
Mol. Mass.:
68019.14
Organism:
Homo sapiens (Human)
Description:
Q06124[E76K]
Residue:
593
  
Inhibitor
Name:
BDBM384184
Synonyms:
4-(6-(4-(Aminomethyl)-4-methylpiperidin-1-yl)-1H-pyrazolo[3,4-b]pyrazin-3-yl)-3-chloro-N-methylpyridin-2-amine US10851110, Example 104 | US11466017, Example 104
Type:
Small organic molecule
Emp. Form.:
C18H23ClN8
Mol. Mass.:
386.882
SMILES:
CNc1nccc(-c2n[nH]c3nc(cnc23)N2CCC(C)(CN)CC2)c1Cl
: