Target
Tyrosine-protein phosphatase non-receptor type 11 [E76K]
Ligand
BDBM384186
Substrate
Meas. Tech.
Enzymatic Assay
IC50
253±n/a nM
Citation
 Jones, PCzako, BCross, JLeonard, PMseeh, FParker, CA Heterocyclic inhibitors of PTPN11 US Patent  US10851110 Publication Date 12/1/2020 
Target
Name:
Tyrosine-protein phosphatase non-receptor type 11 [E76K]
Synonyms:
PTN11_HUMAN PTPN11 SHPTP2 Tyrosine-protein phosphatase non-receptor type 11 (PTPN11)(E76K)
Type:
Enzyme Catalytic Domain
Mol. Mass.:
68019.14
Organism:
Homo sapiens (Human)
Description:
Q06124[E76K]
Residue:
593
  
Inhibitor
Name:
BDBM384186
Synonyms:
4-(6-(4-Amino-4-methylpiperidin-1-yl)-1H-pyrazolo[3,4-b]pyrazine-3-yl)-3-chloropyridin-2-amine US10851110, Example 106 | US11466017, Example 106
Type:
Small organic molecule
Emp. Form.:
C16H19ClN8
Mol. Mass.:
358.829
SMILES:
CC1(N)CCN(CC1)c1cnc2c(n[nH]c2n1)-c1ccnc(N)c1Cl
: