Target
Tyrosine-protein phosphatase non-receptor type 11 [E76K]
Ligand
BDBM475759
Substrate
Meas. Tech.
Enzymatic Assay
IC50
205±n/a nM
Citation
 Jones, PCzako, BCross, JLeonard, PMseeh, FParker, CA Heterocyclic inhibitors of PTPN11 US Patent  US10851110 Publication Date 12/1/2020 
Target
Name:
Tyrosine-protein phosphatase non-receptor type 11 [E76K]
Synonyms:
PTN11_HUMAN PTPN11 SHPTP2 Tyrosine-protein phosphatase non-receptor type 11 (PTPN11)(E76K)
Type:
Enzyme Catalytic Domain
Mol. Mass.:
68019.14
Organism:
Homo sapiens (Human)
Description:
Q06124[E76K]
Residue:
593
  
Inhibitor
Name:
BDBM475759
Synonyms:
3-(2,3-Dichlorophenyl)-6-(2,8-diazaspiro[4.5]decan-8-yl)-1H-pyrazolo[3,4-b]pyrazine US11466017, Example 122
Type:
Small organic molecule
Emp. Form.:
C20H26N8
Mol. Mass.:
378.474
SMILES:
Cc1c(N)nccc1-c1n[nH]c2nc(cnc12)N1CCC2(CCC[C@H]2N)CC1
: