Target
Non-receptor tyrosine-protein kinase TYK2
Ligand
BDBM475685
Substrate
Meas. Tech.
Kinase Assay
EC50
740±n/a nM
Citation
 Greve, DRJepsen, THLarsen, MRitzen, A Bicyclic amines as novel JAK kinase inhibitors US Patent  US10851116 Publication Date 12/1/2020 
Target
Name:
Non-receptor tyrosine-protein kinase TYK2
Synonyms:
Non-receptor tyrosine-protein kinase TYK2 (TYK2) TYK2_HUMAN | Tyrosine-protein kinase TYK2
Type:
Protein
Mol. Mass.:
133666.03
Organism:
Homo sapiens (Human)
Description:
P29597
Residue:
1187
  
Inhibitor
Name:
BDBM475685
Synonyms:
2- [(4aR*,8aS*)- 8a-methyl-7- (7H- pyrrolo[2,3- d]pyrimidin-4- yl)- 3,4,4a,5,6,8- hexahydro-1H- 2,7- naphthyridin-2- yl]pyrimidine- 5-carbonitrile | US10851116, Example 7
Type:
Small organic molecule
Emp. Form.:
C20H22N8
Mol. Mass.:
374.4423
SMILES:
C[C@]12CN(CC[C@H]1CCN(C2)c1ncnc2[nH]ccc12)c1ncc(cn1)C#N
: