Target
Tyrosine-protein kinase JAK3
Ligand
BDBM475687
Substrate
Meas. Tech.
Kinase Assay
EC50
8.00±n/a nM
Citation
 Greve, DRJepsen, THLarsen, MRitzen, A Bicyclic amines as novel JAK kinase inhibitors US Patent  US10851116 Publication Date 12/1/2020 
Target
Name:
Tyrosine-protein kinase JAK3
Synonyms:
JAK-3 JAK3_HUMAN Janus kinase 3 (JAK3) L-JAK | Leukocyte janus kinase
Type:
Protein
Mol. Mass.:
125111.08
Organism:
Homo sapiens (Human)
Description:
P52333
Residue:
1124
  
Inhibitor
Name:
BDBM475687
Synonyms:
(4aR*,8aS*)-8a-methyl-7-(7H-pyrrolo[2,3-d]pyrimidin-4-yl)-3,4,4a,5,6,8-hexahydro-1H-2,7-naphthyridine-2-sulfonamide | US10851116, Example 9
Type:
Small organic molecule
Emp. Form.:
C15H22N6O2S
Mol. Mass.:
350.439
SMILES:
C[C@@]12CN(CC[C@@H]1CCN(C2)S(N)(=O)=O)c1ncnc2[nH]ccc12
: