Target
Tyrosine-protein kinase JAK2
Ligand
BDBM475710
Substrate
Meas. Tech.
Kinase Assay
EC50
67.0±n/a nM
Citation
 Greve, DRJepsen, THLarsen, MRitzen, A Bicyclic amines as novel JAK kinase inhibitors US Patent  US10851116 Publication Date 12/1/2020 
Target
Name:
Tyrosine-protein kinase JAK2
Synonyms:
JAK-2 JAK2_HUMAN Janus kinase 2 (JAK2) | Janus kinase 2 (a protein tyrosine kinase)
Type:
Protein
Mol. Mass.:
130684.68
Organism:
Homo sapiens (Human)
Description:
O60674
Residue:
1132
  
Inhibitor
Name:
BDBM475710
Synonyms:
3-[(3aS*,7aS*)-3a-methyl-5-(7H-pyrrolo[2,3-d]pyrimidin-4-yl)-1,3,4,6,7,7a-hexahydropyrrolo[3,4-c]pyridin-2-yl]-3-oxo-propanenitrile | US10851116, Example 32
Type:
Small organic molecule
Emp. Form.:
C17H20N6O
Mol. Mass.:
324.3803
SMILES:
C[C@]12CN(C[C@H]1CCN(C2)c1ncnc2[nH]ccc12)C(=O)CC#N
: