Target
Tyrosine-protein kinase JAK1
Ligand
BDBM475718
Substrate
Meas. Tech.
Kinase Assay
EC50
3.00±n/a nM
Citation
 Greve, DRJepsen, THLarsen, MRitzen, A Bicyclic amines as novel JAK kinase inhibitors US Patent  US10851116 Publication Date 12/1/2020 
Target
Name:
Tyrosine-protein kinase JAK1
Synonyms:
JAK-1 JAK1A JAK1_HUMAN Janus kinase 1 (JAK1) | Janus kinase 1 JAK1
Type:
Protein
Mol. Mass.:
133293.73
Organism:
Homo sapiens (Human)
Description:
P23458
Residue:
1154
  
Inhibitor
Name:
BDBM475718
Synonyms:
6-[(3aR*,7aS*)-3a-methyl-5-(7H-pyrrolo[2,3-d]pyrimidin-4-yl)-1,3,4,6,7,7a-hexahydropyrrolo[3,4-c]pyridin-2-yl]-4-methyl-pyridine-3-carbonitrile | US10851116, Example 40
Type:
Small organic molecule
Emp. Form.:
C21H23N7
Mol. Mass.:
373.4542
SMILES:
Cc1cc(ncc1C#N)N1C[C@H]2CCN(C[C@@]2(C)C1)c1ncnc2[nH]ccc12
: