Target
Pantetheinase
Ligand
BDBM475848
Substrate
Meas. Tech.
Enzymatic Assay
IC50
4.90±n/a nM
Citation
 Godbout, CFleck, MTKoolman, HF Heteroaromatic compounds as Vanin inhibitors US Patent  US10864201 Publication Date 12/15/2020 
Target
Name:
Pantetheinase
Synonyms:
Pantetheine hydrolase VNN1 Vanin-1 | Vascular non-inflammatory molecule 1
Type:
Enzyme Catalytic Domain
Mol. Mass.:
57002.46
Organism:
Homo sapiens (Human)
Description:
O95497
Residue:
513
  
Inhibitor
Name:
BDBM475848
Synonyms:
US10864201, Ex. 1.4
Type:
Small organic molecule
Emp. Form.:
C18H25N3O2
Mol. Mass.:
315.41
SMILES:
CC1(C)Cc2cc(cnc2N1)C(=O)N1CCC2(C1)CCOCC2
: