Target
Pantetheinase
Ligand
BDBM475871
Substrate
Meas. Tech.
Enzymatic Assay
IC50
18.9±n/a nM
Citation
 Godbout, CFleck, MTKoolman, HF Heteroaromatic compounds as Vanin inhibitors US Patent  US10864201 Publication Date 12/15/2020 
Target
Name:
Pantetheinase
Synonyms:
Pantetheine hydrolase VNN1 Vanin-1 | Vascular non-inflammatory molecule 1
Type:
Enzyme Catalytic Domain
Mol. Mass.:
57002.46
Organism:
Homo sapiens (Human)
Description:
O95497
Residue:
513
  
Inhibitor
Name:
BDBM475871
Synonyms:
US10864201, Ex. 7.3
Type:
Small organic molecule
Emp. Form.:
C22H25ClN4O2
Mol. Mass.:
412.913
SMILES:
CN([C@H]1CCN(C1)C(=O)c1cnc2N[C@@](C)(Cc2c1)c1cccc(Cl)c1)C(C)=O
: