Target
Pantetheinase
Ligand
BDBM475872
Substrate
Meas. Tech.
Enzymatic Assay
IC50
0.100±n/a nM
Citation
 Godbout, CFleck, MTKoolman, HF Heteroaromatic compounds as Vanin inhibitors US Patent  US10864201 Publication Date 12/15/2020 
Target
Name:
Pantetheinase
Synonyms:
Pantetheine hydrolase VNN1 Vanin-1 | Vascular non-inflammatory molecule 1
Type:
Enzyme Catalytic Domain
Mol. Mass.:
57002.46
Organism:
Homo sapiens (Human)
Description:
O95497
Residue:
513
  
Inhibitor
Name:
BDBM475872
Synonyms:
US10864201, Ex. 7.4
Type:
Small organic molecule
Emp. Form.:
C22H23ClN4O3
Mol. Mass.:
426.896
SMILES:
C[C@@]1(Cc2cc(cnc2N1)C(=O)N1CC[C@@H](C1)N1CCOC1=O)c1cccc(Cl)c1
: