Target
Pantetheinase
Ligand
BDBM475893
Substrate
Meas. Tech.
Enzymatic Assay
IC50
0.500±n/a nM
Citation
 Godbout, CFleck, MTKoolman, HF Heteroaromatic compounds as Vanin inhibitors US Patent  US10864201 Publication Date 12/15/2020 
Target
Name:
Pantetheinase
Synonyms:
Pantetheine hydrolase VNN1 Vanin-1 | Vascular non-inflammatory molecule 1
Type:
Enzyme Catalytic Domain
Mol. Mass.:
57002.46
Organism:
Homo sapiens (Human)
Description:
O95497
Residue:
513
  
Inhibitor
Name:
BDBM475893
Synonyms:
US10864201, Ex. 11.6
Type:
Small organic molecule
Emp. Form.:
C18H26N4O2
Mol. Mass.:
330.4246
SMILES:
CN([C@H]1CCN(C1)C(=O)c1cnc2NC(C)(C)CCc2c1)C(C)=O
: