Target
Kappa-type opioid receptor
Ligand
BDBM168149
Substrate
Meas. Tech.
Radioligand Competition Binding Assay
Ki
1055±n/a nM
Citation
 Duarte, FJAnand, NKSharma, PSingh, D Opioid agonists and uses thereof US Patent  US10865186 Publication Date 12/15/2020 
Target
Name:
Kappa-type opioid receptor
Synonyms:
K-OR-1 Kappa-opioid receptor (KOR) Kappa-type opioid receptor (KOR) OPIATE Kappa OPRK1 kappa opioid receptor (KOR)
Type:
G Protein-Coupled Receptor (GPCR)
Mol. Mass.:
42648.76
Organism:
Homo sapiens (Human)
Description:
P41145
Residue:
380
  
Inhibitor
Name:
BDBM168149
Synonyms:
US10081602, Example 23 US9688638, 23
Type:
Small organic molecule
Emp. Form.:
C22H32N2O2
Mol. Mass.:
356.5017
SMILES:
C[C@H]1[C@@H]2N(CC3CC3)CC[C@@]1(C)c1cc(NC(C)(C)CO)ccc1C2=O
: