Target
Mu-type opioid receptor
Ligand
BDBM475939
Substrate
Ki
3918±n/a nM
Citation
 Duarte, FJAnand, NKSharma, PSingh, D Opioid agonists and uses thereof US Patent  US10865186 Publication Date 12/15/2020 
Target
Name:
Mu-type opioid receptor
Synonyms:
M-OR-1 MOR-1 MUOR1 Mu opiate receptor OPRM1 hMOP | mu-type opioid receptor isoform MOR-1
Type:
G Protein-Coupled Receptor (GPCR)
Mol. Mass.:
44789.51
Organism:
Homo sapiens (Human)
Description:
P35372
Residue:
400
  
Inhibitor
Name:
BDBM475939
Synonyms:
Preparation of (1R,2S,6R,11R)-1-(2,5,8,11,14-pentaoxahexadecan-16-yloxy)-3-(cyclopropylmethyl)-6,11-dimethyl-1,2,3,4,5,6-hexahydro-2,6-methanobenzo[d]azocin-8-ol | US10865186, Compound 25
Type:
Small organic molecule
Emp. Form.:
C27H43NO6
Mol. Mass.:
477.6334
SMILES:
COCCOCCOCCOCCO[C@H]1[C@@H]2[C@H](C)[C@@](C)(CCN2CC2CC2)c2cc(O)ccc12
: